{"text_format":"1","workbook":"xlsx","n_sheets":2,"sheets":["Shipping Pre-Alert Form","Form Instruction "],"not_rendered":{"charts":0,"images":20,"macros":1,"external_links":0,"defined_names":71,"comments":1,"pivot_tables":0},"unopened":[],"bounds":{"document_bytes":16777216,"sheet_cells":100000,"rows_first":2000,"rows_last":500,"rows_between":2000,"halvings":0,"cell_chars":16384,"cell_head_chars":4096},"cells_cut":0,"cells_raw":0,"read":"whole","date_system":"1900"}

{"sheet":"Shipping Pre-Alert Form","index":0,"n_rows":251,"n_cols":70,"rows_kept":251,"cut":false,"hidden":false,"merged":[[13,14,13,21],[14,14,14,21],[23,14,23,21],[16,14,16,21],[17,14,17,21],[18,14,18,21],[19,14,19,21],[20,14,20,21],[15,14,15,21],[21,14,21,21],[35,2,35,3],[33,1,34,1],[27,18,27,21],[49,2,49,3],[36,2,36,3],[37,2,37,3],[39,2,39,3],[33,14,33,15],[28,14,31,14],[40,2,40,3],[42,2,42,3],[54,11,61,15],[46,2,46,3],[45,2,45,3],[33,4,34,4],[22,6,22,13],[51,11,53,15],[51,1,52,9],[50,2,50,3],[48,2,48,3],[47,2,47,3],[26,14,26,21],[22,14,22,21],[24,14,24,21],[25,14,25,21],[23,4,23,5],[33,16,33,21],[18,9,18,13],[16,2,16,6],[15,2,15,6],[18,2,18,6],[19,9,19,13],[15,9,15,13],[7,19,7,21],[6,19,6,21],[8,14,8,21],[12,9,12,13],[1,19,1,20],[2,19,2,21],[4,19,4,21],[5,14,5,18],[5,19,5,21],[2,14,2,18],[1,14,1,18],[3,19,3,21],[7,9,7,13],[8,9,8,13],[9,14,9,21],[11,9,11,13],[5,3,5,5],[13,9,13,13],[0,14,0,21],[0,1,0,13],[4,8,4,13],[5,9,5,12],[9,9,9,13],[7,14,7,18],[3,14,3,18],[10,9,10,13],[11,14,11,21],[10,14,10,21],[12,2,12,6],[4,3,4,5],[3,8,3,13],[12,14,12,21],[6,9,6,12],[14,9,14,13],[44,2,44,3],[43,2,43,3],[20,9,20,13],[13,2,13,6],[16,9,16,13],[17,2,17,6],[24,4,24,5],[11,5,11,6],[22,4,22,5],[33,2,34,3],[14,2,14,6],[17,9,17,13],[19,2,19,6],[21,6,21,13]]}
[null,{"$f":"IF(AND(PrepaidIndicator=\"X\",PURFCK=\"X\"),AC6,IF(AND(PrepaidIndicator=\"X\",SNFCK=\"X\"),AC4,IF(AND(CollectIndicator=\"X\",PURFCK=\"X\"),AC5,IF(AND(PrepaidIndicator=\"X\",DSDFCK=\"X\"),AC2,IF(AND(CollectIndicator=\"X\",SNFCK=\"X\"),AC7,IF(AND(CollectIndicator=\"X\",DSDFCK=\"X\"),AC3,))))))","v":"PICK-UP REQUEST FORM (PURF) to Starboard Distribution Ctr, Freight Terms- COLLECT (Starboard Routed)"},null,null,null,null,null,null,null,null,null,null,null,null,null,null,null,null,null,null,null,null,"DESTINATW:ACION","PO PREFIX","ORIGIN",null,null,null,null,null,null,null,null,null,null,null,null,null,null,null,null,null,null,null,null,null,null,null,null,null,"VALIDATED PRX"]
[null,{"$f":"IF(Currency=\"STARBOARD DISTRIBUTION CTR\",AC34,AC33)","v":"Send the completed form as an email attachment to the to PORT AGENT, dlaccountspayable@starboardcruise.com, and to  "},null,null,null,null,null,null,null,null,null,null,null,null,null,null,null,null,null,null,null,null,"Starboard DC",47,"U.S./Canada/North America",null,null,null," DIRECT SHIP DELIVERY PRE-ALERT FORM (Freight Terms - PREPAID) Shipper Notification Form        ",null,null,null,null,"*ATTENTION: ALL INTERNATIONAL OCEAN SHIPMENTS INTO US REQUIRE ISF 10+2. CBS requires an ISF Transmission 72 hrs prior to cargo loading on vessel",null,null,null,null,null,null,null,null,null,null,null,null,null,null,null,null,{"$f":"HLOOKUP(#REF!,$BG$1:$BS$14,2,FALSE)","v":{"$error":"#REF!"}}]
[null,{"$f":"IF(PrepaidIndicator=\"X\",\"logistics.prepaid@starboardcruise.com; transportationinbound@starboardcruise.com\",IF(CollectIndicator=\"X\",\"transportationinbound@starboardcruise.com\",\"\"))","v":"transportationinbound@starboardcruise.com"},null,null,null,null,null,null,null,null,null,null,null,null,null,null,null,null,null,null,null,null,"Direct Ship Delivery",49,"European/Asia/Others",1,1,null," DIRECT SHIP DELIVERY PRE-ALERT FORM (Freight Terms - COLLECT)  Starboard Routed",null,null,null,null,"ISF 10 +2 NUMBER: ",null,null,null,null,null,null,null,null,null,null,null,null,null,null,null,null,{"$f":"HLOOKUP(#REF!,$BG$1:$BS$14,3,FALSE)","v":{"$error":"#REF!"}}]
[null,null,null,null,null,null,null,null,{"$f":"IF(OR(J8<J15,J8>J16),AC31,\"\")","v":""},null,null,null,null,null,null,null,null,null,null,"Destination Discription",null,null,null,null,null,{"$f":"Z3+0.1","v":1.1000000000000001},1.1000000000000001,null,"SHIPPING NOTIFICATION FORM (To Starboard Distribution Ctr) Freight Terms- PREPAID",null,null,null,null,"Enter ISF Number in this Field (Type Over)",null,null,null,null,null,null,null,null,null,null,null,null,null,null,null,null,{"$f":"HLOOKUP(#REF!,$BG$1:$BS$14,4,FALSE)","v":{"$error":"#REF!"}}]
[null,"Shipment Origin:",null,"U.S./Canada/North America",null,null,"Select",null,{"$f":"IF(AND(PrepaidIndicator=\"X\",SNFCK=\"X\"),AH2,\"\")","v":""},null,null,null,null,null,null,null,null,null,null,{"$f":"IF(VLOOKUP(AA3,BF:BM,2,FALSE)=0,\"\",VLOOKUP(AA3,BF:BM,2,FALSE))","v":""},null,null,null,null,null,1.2000000000000002,1.2000000000000002,null,"PICK-UP REQUEST FORM (PURF) to Starboard Distribution Ctr, Freight Terms- COLLECT (Starboard Routed)",null,null,null,null,null,null,null,null,null,null,null,null,null,null,null,null,null,null,null,null,null,{"$f":"HLOOKUP(#REF!,$BG$1:$BS$14,5,FALSE)","v":{"$error":"#REF!"}}]
[null,"Shipment Destination:",null,null,null,null,"Select",null,{"$f":"IF(AND(PrepaidIndicator=\"X\",SNFCK=\"X\"),AH3,\"\")","v":""},null,null,null,null," ",null,null,null,null,null,null,null,null,null,null,null,1.3000000000000003,1.3000000000000003,null,"FORM ERROR - PLEASE SELECT COLLECT TERMS WITH THIS FORM",null,null,null,null,null,null,null,null,null,null,null,null,null,null,null,null,null,null,null,null,null,{"$f":"HLOOKUP(#REF!,$BG$1:$BS$14,6,FALSE)","v":{"$error":"#REF!"}}]
[null,null,null,null,null,null,null,null,"MODE:","GROUND TRANSPORTATION",null,null,null,"Select",null,null,null,null,null,"",null,null,null,null,null,1.4000000000000004,1.4000000000000004,null,"FORM ERROR - PLEASE SELECT PREPAID TERMS WITH THIS FORM",null,null,null,null,null,null,null,null,null,null,null,null,null,null,null,null,null,null,null,null,null,{"$f":"HLOOKUP(#REF!,$BG$1:$BS$14,7,FALSE)","v":{"$error":"#REF!"}}]
[null,null,null,null,null,null,null,null,"READY DATE",null,null,null,null,null,null,null,null,null,null,null,null,null,null,null,null,null,{"$f":"AA7+0.1","v":1.5000000000000004},null,"SELECT FORM TYPE",null,null,null,null,null,null,null,null,null,null,null,null,null,null,null,null,null,null,null,null,null,{"$f":"HLOOKUP(#REF!,$BG$1:$BS$14,8,FALSE)","v":{"$error":"#REF!"}}]
[null,null,null,null,null,null,null,null,"READY TIME",null,null,null,null,null,"PLEASE CONSIGN / SHIP TO PORT AGENT:",null,null,null,null,null,null,null,null,null,null,null,null,null,null,null,null,null,null,null,null,null,null,null,null,null,null,null,null,null,null,null,null,null,null,null,{"$f":"HLOOKUP(#REF!,$BG$1:$BS$14,9,FALSE)","v":{"$error":"#REF!"}}]
[null,"TO:","Starboard Logistics Department",null,null,null,null,null,"CLOSE TIME ",null,null,null,null,null,{"$f":"IF(VLOOKUP(AA3,BF:BM,2,FALSE)=0,\"\",VLOOKUP(AA3,BF:BM,2,FALSE))","v":""},null,null,null,null,null,null,null,null,null,null,null,null,null,"ATTENTION PORT AGENTS:"]
[null,"FOR:","Starboard Cruise Services ",null,null,null,null,null,"FORWARDER"," ",null,null,null,null,{"$f":"IF(VLOOKUP(AA3,BF:BM,3,FALSE)=0,\"\",VLOOKUP(AA3,BF:BM,3,FALSE))","v":""},null,null,null,null,null,null,null,null,null,null,null,null,null,"PURCHASE ORDER Number must be referenced on invoice, otherwise invoice will be returned.",null,null,null,null,null,null,null,null,null,null,null,null,null,null,null,null,null,null,null,null,null,{"$f":"HLOOKUP(#REF!,$BG$1:$BS$14,10,FALSE)","v":{"$error":"#REF!"}}]
[null,null,null,null,null,null,null,null,"CARRIER NAME"," ",null,null,null,null,{"$f":"IF(VLOOKUP(AA3,BF:BM,4,FALSE)=0,\"\",VLOOKUP(AA3,BF:BM,4,FALSE))","v":""},null,null,null,null,null,null,null,null,null,null,null,null,null,"PROOF OF DELIVERY (POD)  MUST BE SIGNED BY THE GIFT SHOP MANAGER  AND EMAILED TO : sales_audit@starboardcruise.com",null,null,null,null,null,null,null,null,null,null,null,null,null,null,null,null,null,null,null,null,null,{"$f":"HLOOKUP(#REF!,$BG$1:$BS$14,11,FALSE)","v":{"$error":"#REF!"}}]
[null,"SHIPPER:",null,null,null,null,null,null,"PRO/WAYBILL/BOL #",null,null,null,null,null,{"$f":"IF(VLOOKUP(AA3,BF:BM,5,FALSE)=0,\"\",VLOOKUP(AA3,BF:BM,5,FALSE))","v":""},null,null,null,null,null,null,null,null,null,null,null,null,null,null,null,null,null,null,null,null,null,null,null,null,null,null,null,null,null,null,null,null,null,null,null,{"$f":"HLOOKUP(#REF!,$BG$1:$BS$14,12,FALSE)","v":{"$error":"#REF!"}}]
[null,"ADDRESS:",null,null,null,null,null,null,"BOOKING #:",null,null,null,null,null,{"$f":"IF(VLOOKUP(AA3,BF:BM,6,FALSE)=0,\"\",VLOOKUP(AA3,BF:BM,6,FALSE))","v":""},null,null,null,null,null,null,null,null,null,null,null,null,null,"ATTENTION  US/Canada/North American Origins",null,null,null,null,null,null,null,null,null,null,null,null,null,null,null,null,null,null,null,null,null,{"$f":"HLOOKUP(#REF!,$BG$1:$BS$14,13,FALSE)","v":{"$error":"#REF!"}}]
[null,null,null,null,null,null,null,null,"PO Start Ship Window",null,null,null,null,null,{"$f":"IF(VLOOKUP(AA3,BF:BM,7,FALSE)=0,\"\",VLOOKUP(AA3,BF:BM,7,FALSE))","v":""},null,null,null,null,null,null,null,null,null,null,null,null,null,"2. Final Invoices must be provided to Starboard Logistics"]
[null,null,null,null,null,null,null,null,"PO Stop Ship Window",null,null,null,null,null,{"$f":"IF(VLOOKUP(AA3,BF:BM,8,FALSE)=0,\"\",VLOOKUP(AA3,BF:BM,8,FALSE))","v":""},null,null,null,null,null,null,null,null,null,null,null,null,null,"3. Liquor or Tobacco shipments must have ATF documents sent to Starboard Logistics along with this form"]
[null,"CONTACT:",null,null,null,null,null,null,{"$f":"IF(AND(CollectIndicator=\"X\",PURFCK=\"X\"),\"Carrier Account Number\",\"\")","v":"Carrier Account Number"},null,null,null,null,null,"IF PORT AGENT IS NOT LISTED, PLEASE TYPE IN INFORMATION BELOW:",null,null,null,null,null,null,null,null,null,null,null,null,null,"4. In-Bond shipments must have 7512 (IT) sent to Starboard CDC Department and Forwarder prior to shipment "]
[null,"PHONE #:",null,null,null,null,null,null,"Attn: ","Starboard Transportation Team",null,null,null,null,null,null,null,null,null,null,null,null,null,null,null,null,null,null,"1.  A Correct Consignment and Shipping address as outlined in the body of this form"]
[null,"FAX #:"]
[null,"email:",null,null,null,null,null,null," "," ",null,null,null,null,null,null,null,null,null,null,null,null,null,null,null,null,null,null,"NON North American Origins"]
[null,null,null,null,null,null,null,null,"email:","transportationinbound@starboardcruise.com",null,null,null,null,null,null,null,null,null,null,null,null,null,null,null,null,null,null,"2. Final Invoices must be sent to the Accounts Payable Department within 24 hours after pick-up."]
[null,"Freight Payment Terms",null,null,"Form Type",null,"For the most current Vendor Requirements please visit access the websight indicated below"]
[null,"X","Collect",null,"Shipping Notification Form (SNF) Miami DC",null,"http://logistics.starboardcruise.com "]
[null,null,"Prepaid","X","Pick-Up Request Form (PURF)  Miami DC",null," Are goods accompanied by a CITES declaration?",null,null,null,null," ","NO"," ",null,null,null,null,null,null,null,null,null,null,null,null,null,null,"PRIOR NOTIFICATION SUBMISSION REQUIRED"]
[null,"STB Freight Terms",null,null,"Direct Ship Delivery Form (DSDF)",null," Are goods mentioned below DGR or Hazardous Material?",null,null,null,null," ","NO"," ",null,null,null,null,null,null,null,null,null,null,null,null,null,null,"Country of Origin"]
[null,"X","FCA- Named Place of Origin",null,null,null,"  ATF or IT shipment?",null,null,null,null,"In bond?","NO","(CK IF YES)",null,null,null,null,null,null,null,null,null,null,null,null,null,null,"Country of Exportation"]
[null,null,"FCA- Named Consolidation Point",null,null,"Temp Control: Minimum",null,null,"Maximum",null,"Scale",null,null,null,null,null,null,null,null,null,null,null,null,null,null,null,null,null,"Related Parties (if applicable)"]
[null,null,"DAP- Delivered at Place",null,null,null,null,"Required Information for Prior Submission",null,null,null,null,null,null,null,null,null,null,"Pallet Type and Quantity Summary",null,null,null,null,null,null,null,null,null,"Manufacture Name"]
[null,null,"DAT- Delivered at Terminal",null,null,null,null,{"$f":"IF(AND(PrepaidIndicator=\"X\",SNFCK=\"X\"),AC25,\"\")","v":""},null,null,null,null,null,null,null,null,null,null,null,"  Regular Stackable",null,null,null,null,null,null,null,null,"ISF 10+2 Filler Information"]
[null,null,"DDP",null,null,null,null,{"$f":"IF(AND(PrepaidIndicator=\"X\",SNFCK=\"X\"),AC26,\"\")","v":""},null,null,null,null,null,null,null,null,null,null,null,"Regular Non-Stackable"]
[null,null,"Local Hand Delv (Use with DDP)",null,null,null,null,{"$f":"IF(AND(PrepaidIndicator=\"X\",SNFCK=\"X\"),AC27,\"\")","v":""},null,null,null,null,null,null,null,null,null,null,null,"Box (Gaylord) Pallets",null,null,null,null,null,null,null,null,"WARNING: VENDOR COMPLIANCE ERROR- READY DATE MUST FALL WITHIN SHIPPING WINDOW"]
[null,null,null,null,null,null,null,{"$f":"IF(AND(PrepaidIndicator=\"X\",SNFCK=\"X\"),AC28,\"\")","v":""},null,null,null,null,null,null,null,null,null,null,null,"Total Pallet Quantity",{"$f":"IF(SUM(U29:U31)>0,SUM(U29:U31),\"\")","v":""},{"$f":"IF(AND(U32>U29,U32>U30,U32>U31),\"Mixed\",IF(U29>0,\"Stackable\",IF(U30>0,\"Non-Stackable\",IF(U31>0,\"Gaylord\",\"\"))))","v":""}]
[null,null,null,null,null,null,null,{"$f":"IF(AND(PrepaidIndicator=\"X\",SNFCK=\"X\"),AC29,\"\")","v":""},null,null,null,null,null,null,null,null,null,null,null,null,null,null,null,null,null,null,null,null,"Send the completed form as an email attachment to the to PORT AGENT, dlaccountspayable@starboardcruise.com, and to  "]
[null,"                     PO Number","                                            Commodity HTSUS Number (at 6 digit level)",null,"                      Merchandise Inv#","Commodity","Units","UOM","Qty of Cartons","MEASUREMENTS PER CARTON",null,null,null,null,"Total per Carton Qty",null,"Pallet Detail (summerized by unique dimensions)",null,null,null,null,null,null,null,null,null,null,null,"Send the completed form as an email attachment to: dlaccountspayable@starboardcruise.com and to  "]
[null,null,null,null,null,null,null,null,"List by common size and dimensions",{"$f":"IF($D$5=\"U.S./Canada/North America\",\"Weight in lbs.\",\"Weight in kgs.\")","v":"Weight in lbs."},{"$f":"IF($D$5=\"U.S./Canada/North America\",\"L     inches\",\"L      cm\")","v":"L     inches"},{"$f":"IF($D$5=\"U.S./Canada/North America\",\"W     inches\",\"W    cm\")","v":"W     inches"},{"$f":"IF($D$5=\"U.S./Canada/North America\",\"H      inches\",\"H      cm\")","v":"H      inches"},{"$f":"IF($D$5=\"U.S./Canada/North America\",\"Volume in Feet\",\"Volume in Meters\")","v":"Volume in Feet"},{"$f":"IF($D$5=\"U.S./Canada/North America\",\"Gross Weight in Pounds\",\"Gross Weight in Kilos\")","v":"Gross Weight in Pounds"},{"$f":"IF($D$5=\"U.S./Canada/North America\",\"Gross Volume (cubic ft)\",\"Gross Volume (Cubic Meters\")","v":"Gross Volume (cubic ft)"},"Number of Pallets","Weight per Pallet",{"$f":"IF($D$5=\"U.S./Canada/North America\",\"L inches\",\"L cm\")","v":"L inches"},{"$f":"IF($D$5=\"U.S./Canada/North America\",\"W inches\",\"W cm\")","v":"W inches"},{"$f":"IF($D$5=\"U.S./Canada/North America\",\"H inches\",\"H cm\")","v":"H inches"},{"$f":"IF($D$5=\"U.S./Canada/North America\",\"Volume in Feet\",\"Volume in Meters\")","v":"Volume in Feet"}]
[null,null,null,null,null,null,null,null,null,null,null,null,null,{"$f":"IF(K36*L36*M36>0,(IF($D$5=\"U.S./Canada/North America\",K36*L36*M36/1728,K36*L36*M36/1000000)),\"\")","v":""},{"$f":"IF(J36>0,(IF(I36>0,J36*I36,\"\")),\"\")","v":""},{"$f":"IF(N36<>\"\",(IF(I36>0,N36*I36,\"\")),\"\")","v":""},null,null,null,null,null,{"$f":"IF(S36*T36*U36>0,(IF($D$5=\"U.S./Canada/North America\",S36*T36*U36/1728,S36*T36*U36/1000000)),\"\")","v":""}]
[null,null,null,null,null,null,null,null,null,null,null,null,null,{"$f":"IF(K37*L37*M37>0,(IF($D$5=\"U.S./Canada/North America\",K37*L37*M37/1728,K37*L37*M37/1000000)),\"\")","v":""},{"$f":"IF(J37>0,(IF(I37>0,J37*I37,\"\")),\"\")","v":""},{"$f":"IF(N37<>\"\",(IF(I37>0,N37*I37,\"\")),\"\")","v":""},null,null,null,null,null,{"$f":"IF(S37*T37*U37>0,(IF($D$5=\"U.S./Canada/North America\",S37*T37*U37/1728,S37*T37*U37/1000000)),\"\")","v":""}]
[null,null,null,null,null,null,null,null,null,null,null,null,null,{"$f":"IF(K38*L38*M38>0,(IF($D$5=\"U.S./Canada/North America\",K38*L38*M38/1728,K38*L38*M38/1000000)),\"\")","v":""},"","",null,null,null,null,null,{"$f":"IF(S38*T38*U38>0,(IF($D$5=\"U.S./Canada/North America\",S38*T38*U38/1728,S38*T38*U38/1000000)),\"\")","v":""}]
[]
[null,null,null,null,null,null,null,{"$f":"IF(AND(G40<>\"\",$F40<>\"*\",$F40<>\"\"\"\"),IF(ISNA(VLOOKUP($F40,$AK:$AL,2,FALSE)),\"\",VLOOKUP($F40,$AK:$AL,2,FALSE)),\"\")","v":""},null,null,null,null,null,"","","",null,null,null,null,null,{"$f":"IF(S40*T40*U40>0,(IF($D$5=\"U.S./Canada/North America\",S40*T40*U40/1728,S40*T40*U40/1000000)),\"\")","v":""}]
[null,null,null,null,null,null,null,{"$f":"IF(AND(G41<>\"\",$F41<>\"*\",$F41<>\"\"\"\"),IF(ISNA(VLOOKUP($F41,$AK:$AL,2,FALSE)),\"\",VLOOKUP($F41,$AK:$AL,2,FALSE)),\"\")","v":""}," ",null,null,null,null,"","","",null,null,null,null,null,{"$f":"IF(S41*T41*U41>0,(IF($D$5=\"U.S./Canada/North America\",S41*T41*U41/1728,S41*T41*U41/1000000)),\"\")","v":""}]
[]
[null,null,null,null,null,null,null,{"$f":"IF(AND(G43<>\"\",$F43<>\"*\",$F43<>\"\"\"\"),IF(ISNA(VLOOKUP($F43,$AK:$AL,2,FALSE)),\"\",VLOOKUP($F43,$AK:$AL,2,FALSE)),\"\")","v":""}," ",null,null,null,null,{"$f":"IF(K43*L43*M43>0,(IF($D$5=\"U.S./Canada/North America\",K43*L43*M43/1728,K43*L43*M43/1000000)),\"\")","v":""},{"$f":"IF(J43>0,(IF(I43>0,J43*I43,\"\")),\"\")","v":""},{"$f":"IF(N43<>\"\",(IF(I43>0,N43*I43,\"\")),\"\")","v":""},null,null,null,null,null,{"$f":"IF(S43*T43*U43>0,(IF($D$5=\"U.S./Canada/North America\",S43*T43*U43/1728,S43*T43*U43/1000000)),\"\")","v":""}]
[null,null,null,null,null,null,null,""," ",null,null,null,null,{"$f":"IF(K44*L44*M44>0,(IF($D$5=\"U.S./Canada/North America\",K44*L44*M44/1728,K44*L44*M44/1000000)),\"\")","v":""},{"$f":"IF(J44>0,(IF(I44>0,J44*I44,\"\")),\"\")","v":""},{"$f":"IF(N44<>\"\",(IF(I44>0,N44*I44,\"\")),\"\")","v":""},null,null,null,null,null,""]
[null,null,null,null,null,null,null,""," ",null,null,null,null,{"$f":"IF(K45*L45*M45>0,(IF($D$5=\"U.S./Canada/North America\",K45*L45*M45/1728,K45*L45*M45/1000000)),\"\")","v":""},{"$f":"IF(J45>0,(IF(I45>0,J45*I45,\"\")),\"\")","v":""},{"$f":"IF(N45<>\"\",(IF(I45>0,N45*I45,\"\")),\"\")","v":""},null,null,null,null,null,""]
[null,null,null,null,null,null,null,""," ",null,null,null,null,{"$f":"IF(K46*L46*M46>0,(IF($D$5=\"U.S./Canada/North America\",K46*L46*M46/1728,K46*L46*M46/1000000)),\"\")","v":""},{"$f":"IF(J46>0,(IF(I46>0,J46*I46,\"\")),\"\")","v":""},{"$f":"IF(N46<>\"\",(IF(I46>0,N46*I46,\"\")),\"\")","v":""},null,null,null,null,null,""]
[null,null,null,null,null,null,null,""," ",null,null,null,null,{"$f":"IF(K47*L47*M47>0,(IF($D$5=\"U.S./Canada/North America\",K47*L47*M47/1728,K47*L47*M47/1000000)),\"\")","v":""},{"$f":"IF(J47>0,(IF(I47>0,J47*I47,\"\")),\"\")","v":""},{"$f":"IF(N47<>\"\",(IF(I47>0,N47*I47,\"\")),\"\")","v":""},null,null,null,null,null,""]
[null,null,null,null,null,null,null,""," ",null,null,null,null,"","","",null,null,null,null,null,""]
[null,null,null,null,null,null,null,""," ",null,null,null,null,"","","",null,null,null,null,null,""]
[null,null,null,null,null,null,null,""," ",null,null,null,null,"","","",null,null,null,null,null,""]
[null,null,null,null,null,null,null,""," ",null,null,null,null,"","","",null,null,null,null,null,""]
[null,"ATTENTION VENDORS:  Failure to provide the following may result in a vendor non-compliance penalty being assessed against your company.",null,null,null,null,null,null,null,null,null,{"$f":"IF(CollectIndicator=\"X\",\"Bill Collect Freight Charges To  Attn: Freight Accounts Payable Dept\",\"Starboard Corporate Office\")","v":"Bill Collect Freight Charges To  Attn: Freight Accounts Payable Dept"},null,null,null,null,null,null,null,null,null,""]
[null,null,null,null,null,null,null,null,null,null,null,null,null,null,null,null,null,null,null,null,null,""]
[null,null,null,null,null,null,null,null,null,null,null,null,null,null,null,null,null,null,null,null,null,""]
[null,"1. A Correct Consigment and Shipping address as outlined in the body of this form",null,null,null,null,null,null,null,null,null,"Starboard Cruise Services                   8400 NW 36th Street, Suite 600          Miami, FL 33166",null,null,null,null,null,null,null,null,null,""]
[null,{"$f":"IF(AND($D$5=\"U.S./Canada/North America\",Currency=\"STARBOARD DISTRIBUTION CTR\"),AC15,AC21)","v":"2. Final Invoices must be sent to the Accounts Payable Department within 24 hours after pick-up."},null,null,null,null,null,null,null,null,null,null,null,null,null,null,null,null,null,null,null,""]
[null,{"$f":"IF(AND($D$5=\"U.S./Canada/North America\",Currency=\"STARBOARD DISTRIBUTION CTR\"),AC16,\"\")","v":""},null,null,null,null,null,null,null,null,null,null,null,null,null,null,null,null,null,null,null,""]
[null,{"$f":"IF(AND($D$5=\"U.S./Canada/North America\",Currency=\"STARBOARD DISTRIBUTION CTR\"),AC17,\"\")","v":""},null,null,null,null,null,null,null,null,null,null,null,null,null,null,null,null,null,null,null,""]
[null,null,null,null,null,null,null,null,null,null,null,null,null,null,null,null,null,null,null,null,null,""]
[null,null,null,null,null,null,null,null,null,null,null,null,null,null,null,null,null,null,null,null,null,""]
[null,null,null,null,null,null,null,null,null,null,null,null,null,null,null,null,null,null,null,null,null,""]
[null,null,null,null,null,null,null,null,null,null,null,null,null,null,null,null,{"$f":"SUBTOTAL(9,Q36:Q61)","v":0},{"$f":"SUBTOTAL(9,R36:R61)","v":0},null,null,null,{"$f":"SUBTOTAL(9,V36:V61)","v":0}]
[]
[]
[]
[null,null,null,null,null,null,null,null,null,null,null,null,null,null,null," "]
[null,null,null,null,null,null,null,null,null,null,null,null,null,null,null," "]
[]
[]
[]
[]
[]
[]
[]
[]
[]
[]
[]
[]
[]
{"$rows_left_out":172}
{"sheet":"Form Instruction ","index":1,"n_rows":145,"n_cols":3,"rows_kept":145,"cut":false,"hidden":false,"merged":[]}
[]
[]
[]
[]
[]
[]
[]
[]
[]
[]
[]
[]
[]
[]
[]
[]
[]
[]
[]
[]
[]
[]
[]
[]
[]
[]
[]
[]
[]
[]
[]
[]
[]
[]
[]
[]
[]
[]
[null," "]
[null," "]
[]
[]
[]
[]
[]
[]
[]
[]
[]
[]
[]
[]
[]
[]
[]
[]
[]
[]
[]
[]
[]
[]
[]
[]
[]
[]
[]
[]
[]
[]
[]
[]
[]
[]
[]
[]
[]
[null,null," "]
[]
[]
{"$rows_left_out":65}